Home Forums Software discussion OS – Buildroot Build root compile errors

This topic contains 0 replies, has 1 voice, and was last updated by  nick 3 weeks ago.

Viewing 1 post (of 1 total)
  • Author
    Posts
  • #5928

    nick
    Participant

    Hello..

    Makefile:1212: recipe for target ‘parted.info’ failed
    make[5]: *** [parted.info] Error 127
    Makefile:1379: recipe for target ‘install-recursive’ failed
    make[4]: *** [install-recursive] Error 1
    Makefile:1255: recipe for target ‘install-recursive’ failed
    make[3]: *** [install-recursive] Error 1
    Makefile:1555: recipe for target ‘install’ failed
    make[2]: *** [install] Error 2

    Recently, I compiled the buildroot after downloading the source (Espressobin)
    but there is the above error..
    Why does it happen??

Viewing 1 post (of 1 total)

You must be logged in to reply to this topic.

Signup to our newsletter

Technical specification tables can not be displayed on mobile. Please view on desktop